Reaction Details
TargetPotassium voltage-gated channel subfamily H member 2
LigandBDBM50252833
Substrate/Competitorn/a
Meas. Tech.ChEMBL_534605 (CHEMBL989030)
IC50 585±n/a nM
Citation Le Bourdonnec, BWindh, RTAjello, CWLeister, LKGu, MChu, GHTuthill, PABarker, WMKoblish, MWiant, DDGraczyk, TMBelanger, SCassel, JAFeschenko, MSBrogdon, BLSmith, SAChrist, DDDerelanko, MJKutz, SLittle, PJDeHaven, RNDeHaven-Hudkins, DLDolle, RE Potent, orally bioavailable delta opioid receptor agonists for the treatment of pain: discovery of N,N-diethyl-4-(5-hydroxyspiro[chromene-2,4'-piperidine]-4-yl)benzamide (ADL5859). J Med Chem51:5893-6 (2008) 
 
Potassium voltage-gated channel subfamily H member 2
Name:Potassium voltage-gated channel subfamily H member 2
Type:Multi-pass membrane protein
Mol. Mass.:126672.65
Organism:Homo sapiens (Human)
Description:Q12809
Residue:1159
BDBM50252833
NameBDBM50252833
Synonyms:4-(4-Methoxyphenyl)spiro[chromene-2,4'-piperidine] | CHEMBL495073
TypeSmall organic molecule
Emp. Form.C20H21NO2
Mol. Mass.307.3862
SMILESCOc1ccc(cc1)C1=CC2(CCNCC2)Oc2ccccc12