Reaction Details
TargetPotassium voltage-gated channel subfamily H member 2
LigandBDBM50252832
Substrate/Competitorn/a
Meas. Tech.ChEMBL_534605 (CHEMBL989030)
IC50 379±n/a nM
Citation Le Bourdonnec, BWindh, RTAjello, CWLeister, LKGu, MChu, GHTuthill, PABarker, WMKoblish, MWiant, DDGraczyk, TMBelanger, SCassel, JAFeschenko, MSBrogdon, BLSmith, SAChrist, DDDerelanko, MJKutz, SLittle, PJDeHaven, RNDeHaven-Hudkins, DLDolle, RE Potent, orally bioavailable delta opioid receptor agonists for the treatment of pain: discovery of N,N-diethyl-4-(5-hydroxyspiro[chromene-2,4'-piperidine]-4-yl)benzamide (ADL5859). J Med Chem51:5893-6 (2008) 
 
Potassium voltage-gated channel subfamily H member 2
Name:Potassium voltage-gated channel subfamily H member 2
Type:Multi-pass membrane protein
Mol. Mass.:126672.65
Organism:Homo sapiens (Human)
Description:Q12809
Residue:1159
BDBM50252832
NameBDBM50252832
Synonyms:4-(4-(Trifluoromethyl)phenyl)spiro [chromene-2,4'-piperidine] | CHEMBL492449
TypeSmall organic molecule
Emp. Form.C20H18F3NO
Mol. Mass.345.3582
SMILESFC(F)(F)c1ccc(cc1)C1=CC2(CCNCC2)Oc2ccccc12