Reaction Details
TargetKappa-type opioid receptor
LigandBDBM50252832
Substrate/Competitorn/a
Meas. Tech.ChEMBL_534636 (CHEMBL993333)
Ki 2000±n/a nM
Citation Le Bourdonnec, BWindh, RTAjello, CWLeister, LKGu, MChu, GHTuthill, PABarker, WMKoblish, MWiant, DDGraczyk, TMBelanger, SCassel, JAFeschenko, MSBrogdon, BLSmith, SAChrist, DDDerelanko, MJKutz, SLittle, PJDeHaven, RNDeHaven-Hudkins, DLDolle, RE Potent, orally bioavailable delta opioid receptor agonists for the treatment of pain: discovery of N,N-diethyl-4-(5-hydroxyspiro[chromene-2,4'-piperidine]-4-yl)benzamide (ADL5859). J Med Chem51:5893-6 (2008) 
 
Kappa-type opioid receptor
Name:Kappa-type opioid receptor
Type:G Protein-Coupled Receptor (GPCR)
Mol. Mass.:42648.76
Organism:Homo sapiens (Human)
Description:P41145
Residue:380
BDBM50252832
NameBDBM50252832
Synonyms:4-(4-(Trifluoromethyl)phenyl)spiro [chromene-2,4'-piperidine] | CHEMBL492449
TypeSmall organic molecule
Emp. Form.C20H18F3NO
Mol. Mass.345.3582
SMILESFC(F)(F)c1ccc(cc1)C1=CC2(CCNCC2)Oc2ccccc12