Reaction Details
TargetPotassium voltage-gated channel subfamily H member 2
LigandBDBM50252830
Substrate/Competitorn/a
Meas. Tech.ChEMBL_534605 (CHEMBL989030)
IC50 680±n/a nM
Citation Le Bourdonnec, BWindh, RTAjello, CWLeister, LKGu, MChu, GHTuthill, PABarker, WMKoblish, MWiant, DDGraczyk, TMBelanger, SCassel, JAFeschenko, MSBrogdon, BLSmith, SAChrist, DDDerelanko, MJKutz, SLittle, PJDeHaven, RNDeHaven-Hudkins, DLDolle, RE Potent, orally bioavailable delta opioid receptor agonists for the treatment of pain: discovery of N,N-diethyl-4-(5-hydroxyspiro[chromene-2,4'-piperidine]-4-yl)benzamide (ADL5859). J Med Chem51:5893-6 (2008) 
 
Potassium voltage-gated channel subfamily H member 2
Name:Potassium voltage-gated channel subfamily H member 2
Type:Multi-pass membrane protein
Mol. Mass.:126672.65
Organism:Homo sapiens (Human)
Description:Q12809
Residue:1159
BDBM50252830
NameBDBM50252830
Synonyms:4-Phenylspiro[chromene-2,4'-piperidine] | CHEMBL492447
TypeSmall organic molecule
Emp. Form.C19H19NO
Mol. Mass.277.3603
SMILESC1CC2(CCN1)Oc1ccccc1C(=C2)c1ccccc1