Reaction Details
TargetSolute carrier family 22 member 1
LigandBDBM67545
Substrate/Competitorn/a
Meas. Tech.ChEMBL_534654 (CHEMBL994103)
IC50 17200±n/a nM
Citation Ahlin, GKarlsson, JPedersen, JMGustavsson, LLarsson, RMatsson, PNorinder, UBergström, CAArtursson, P Structural requirements for drug inhibition of the liver specific human organic cation transport protein 1. J Med Chem51:5932-42 (2008) 
 
Solute carrier family 22 member 1
Name:Solute carrier family 22 member 1
Type:Enzyme Catalytic Domain
Mol. Mass.:61154.85
Organism:Homo sapiens (Human)
Description:Adrenergic Alpha 0 HUMAN::O15245
Residue:554
BDBM67545
NameBDBM67545
Synonyms:N,N-dimethyl-3-(10-phenothiazinyl)-1-propanamine;hydrochloride N,N-dimethyl-3-phenothiazin-10-ylpropan-1-amine;hydrochloride SR-01000000228-4 cid_5887 | dimethyl(3-phenothiazin-10-ylpropyl)amine;hydrochloride
TypeSmall organic molecule
Emp. Form.C17H20N2S
Mol. Mass.284.419
SMILESCN(C)CCCN1c2ccccc2Sc2ccccc12