Reaction Details
TargetThymidylate synthase
LigandBDBM50252968
Substrate/Competitorn/a
Meas. Tech.ChEMBL_539761 (CHEMBL1034979)
IC50 40±n/a nM
Citation Gangjee, AQiu, YLi, WKisliuk, RL Potent dual thymidylate synthase and dihydrofolate reductase inhibitors: classical and nonclassical 2-amino-4-oxo-5-arylthio-substituted-6-methylthieno[2,3-d]pyrimidine antifolates. J Med Chem51:5789-97 (2008) 
 
Thymidylate synthase
Name:Thymidylate synthase
Type:Enzyme
Mol. Mass.:35718.07
Organism:Homo sapiens (Human)
Description:n/a
Residue:313
BDBM50252968
NameBDBM50252968
Synonyms:CHEMBL522363 | N-{4-[(2-Amino-6-methyl-4-oxo-3,4-dihydrothieno[2,3-d]pyrimidin-5-yl)sulfanyl]benzoyl}-L-glutamic acid
TypeSmall organic molecule
Emp. Form.C18H16N4O6S2
Mol. Mass.448.473
SMILESCc1sc2nc(N)[nH]c(=O)c2c1Sc1ccc(cc1)C(=O)N(CCC(O)=O)C(O)=O