Reaction Details
TargetFatty-acid amide hydrolase 1
LigandBDBM23316
Substrate/Competitorn/a
Meas. Tech.ChEMBL_494689 (CHEMBL938648)
Ki 0.280±n/a nM
Citation Seierstad, MBreitenbucher, JG Discovery and development of fatty acid amide hydrolase (FAAH) inhibitors. J Med Chem51:7327-43 (2009) 
 
Fatty-acid amide hydrolase 1
Name:Fatty-acid amide hydrolase 1
Type:Protein
Mol. Mass.:63071.19
Organism:Homo sapiens (Human)
Description:O00519
Residue:579
BDBM23316
NameBDBM23316
Synonyms:7-phenyl-1-{pyrido[2,3-d][1,3]oxazol-2-yl}heptan-1-one OL-92
TypeSmall organic molecule
Emp. Form.C19H20N2O2
Mol. Mass.308.3743
SMILESO=C(CCCCCCc1ccccc1)c1nc2ncccc2o1