Reaction Details
TargetNeuronal acetylcholine receptor subunit alpha-4
LigandBDBM50275262
Substrate/Competitorn/a
Meas. Tech.ChEMBL_494698 (CHEMBL938657)
Ki 150±n/a nM
Citation Hansen, CPJensen, AAChristensen, JKBalle, TLiljefors, TFrølund, B Novel acetylcholine and carbamoylcholine analogues: development of a functionally selective alpha4beta2 nicotinic acetylcholine receptor agonist. J Med Chem51:7380-95 (2009) 
 
Neuronal acetylcholine receptor subunit alpha-4
Name:Neuronal acetylcholine receptor subunit alpha-4
Type:Enzyme
Mol. Mass.:70196.44
Organism:Rattus norvegicus (Rat)
Description:P09483
Residue:630
BDBM50275262
NameBDBM50275262
Synonyms:3-(dimethylamino)butyl dimethylcarbamate CHEMBL486572
TypeSmall organic molecule
Emp. Form.C9H20N2O2
Mol. Mass.188.2673
SMILESCC(CCOC(=O)N(C)C)N(C)C