Reaction Details
TargetNeuronal acetylcholine receptor subunit alpha-3
LigandBDBM50275264
Substrate/Competitorn/a
Meas. Tech.ChEMBL_494697 (CHEMBL938656)
Ki 2600±n/a nM
Citation Hansen, CPJensen, AAChristensen, JKBalle, TLiljefors, TFrølund, B Novel acetylcholine and carbamoylcholine analogues: development of a functionally selective alpha4beta2 nicotinic acetylcholine receptor agonist. J Med Chem51:7380-95 (2009) 
 
Neuronal acetylcholine receptor subunit alpha-3
Name:Neuronal acetylcholine receptor subunit alpha-3
Type:Enzyme
Mol. Mass.:56995.52
Organism:Rattus norvegicus (Rat)
Description:P04757
Residue:499
BDBM50275264
NameBDBM50275264
Synonyms:3-(dimethylamino)butyl piperidine-1-carboxylate | CHEMBL486773
TypeSmall organic molecule
Emp. Form.C12H24N2O2
Mol. Mass.228.3312
SMILESCC(CCOC(=O)N1CCCCC1)N(C)C