Reaction Details
TargetNeuronal acetylcholine receptor subunit alpha-3
LigandBDBM50275265
Substrate/Competitorn/a
Meas. Tech.ChEMBL_494697 (CHEMBL938656)
Ki 10000±n/a nM
Citation Hansen, CPJensen, AAChristensen, JKBalle, TLiljefors, TFrølund, B Novel acetylcholine and carbamoylcholine analogues: development of a functionally selective alpha4beta2 nicotinic acetylcholine receptor agonist. J Med Chem51:7380-95 (2009) 
 
Neuronal acetylcholine receptor subunit alpha-3
Name:Neuronal acetylcholine receptor subunit alpha-3
Type:Enzyme
Mol. Mass.:56995.52
Organism:Rattus norvegicus (Rat)
Description:P04757
Residue:499
BDBM50275265
NameBDBM50275265
Synonyms:3-((Azetidine-1-carbonyloxy)-1-methylpropyl)dimethylammonium Oxalate | CHEMBL486774
TypeSmall organic molecule
Emp. Form.C10H20N2O2
Mol. Mass.200.278
SMILESCC(CCOC(=O)N1CCC1)N(C)C