Reaction Details
TargetNeuronal acetylcholine receptor subunit alpha-4
LigandBDBM50274820
Substrate/Competitorn/a
Meas. Tech.ChEMBL_494698 (CHEMBL938657)
Ki 460±n/a nM
Citation Hansen, CPJensen, AAChristensen, JKBalle, TLiljefors, TFrølund, B Novel acetylcholine and carbamoylcholine analogues: development of a functionally selective alpha4beta2 nicotinic acetylcholine receptor agonist. J Med Chem51:7380-95 (2009) 
 
Neuronal acetylcholine receptor subunit alpha-4
Name:Neuronal acetylcholine receptor subunit alpha-4
Type:Enzyme
Mol. Mass.:70196.44
Organism:Rattus norvegicus (Rat)
Description:P09483
Residue:630
BDBM50274820
NameBDBM50274820
Synonyms:3-((Cyclobutanecarbonyloxy)-1-methylpropyl)dimethylammonium Oxalate | CHEMBL457916
TypeSmall organic molecule
Emp. Form.C11H21NO2
Mol. Mass.199.2899
SMILESCC(CCOC(=O)C1CCC1)N(C)C