Reaction Details
TargetNeuronal acetylcholine receptor subunit alpha-7
LigandBDBM50274821
Substrate/Competitorn/a
Meas. Tech.ChEMBL_494699 (CHEMBL938658)
Ki 190000±n/a nM
Citation Hansen, CPJensen, AAChristensen, JKBalle, TLiljefors, TFrølund, B Novel acetylcholine and carbamoylcholine analogues: development of a functionally selective alpha4beta2 nicotinic acetylcholine receptor agonist. J Med Chem51:7380-95 (2009) 
 
Neuronal acetylcholine receptor subunit alpha-7
Name:Neuronal acetylcholine receptor subunit alpha-7
Type:Enzyme
Mol. Mass.:56502.44
Organism:Rattus norvegicus (Rat)
Description:Q05941
Residue:502
BDBM50274821
NameBDBM50274821
Synonyms:3-((Benzoyloxy)-1-methylpropyl)dimethylammonium Chloride | CHEMBL449444
TypeSmall organic molecule
Emp. Form.C13H19NO2
Mol. Mass.221.2955
SMILESCC(CCOC(=O)c1ccccc1)N(C)C