Reaction Details
TargetNeuronal acetylcholine receptor subunit alpha-3
LigandBDBM50275266
Substrate/Competitorn/a
Meas. Tech.ChEMBL_494700 (CHEMBL938659)
Ki 300±n/a nM
Citation Hansen, CPJensen, AAChristensen, JKBalle, TLiljefors, TFrølund, B Novel acetylcholine and carbamoylcholine analogues: development of a functionally selective alpha4beta2 nicotinic acetylcholine receptor agonist. J Med Chem51:7380-95 (2009) 
 
Neuronal acetylcholine receptor subunit alpha-3
Name:Neuronal acetylcholine receptor subunit alpha-3
Type:Enzyme
Mol. Mass.:56995.52
Organism:Rattus norvegicus (Rat)
Description:P04757
Residue:499
BDBM50275266
NameBDBM50275266
Synonyms:3-((3,3-Dimethylazetidine-1-carbonyloxy)-1-methylpropyl)dimethylammonium Oxalate | CHEMBL486775
TypeSmall organic molecule
Emp. Form.C12H24N2O2
Mol. Mass.228.3312
SMILESCC(CCOC(=O)N1CC(C)(C)C1)N(C)C