Reaction Details
TargetNeuronal acetylcholine receptor subunit alpha-3
LigandBDBM10759
Substrate/Competitorn/a
Meas. Tech.ChEMBL_494700 (CHEMBL938659)
EC50 8900±n/a nM
Citation Hansen, CPJensen, AAChristensen, JKBalle, TLiljefors, TFrølund, B Novel acetylcholine and carbamoylcholine analogues: development of a functionally selective alpha4beta2 nicotinic acetylcholine receptor agonist. J Med Chem51:7380-95 (2009) 
 
Neuronal acetylcholine receptor subunit alpha-3
Name:Neuronal acetylcholine receptor subunit alpha-3
Type:Enzyme
Mol. Mass.:56995.52
Organism:Rattus norvegicus (Rat)
Description:P04757
Residue:499
BDBM10759
NameBDBM10759
Synonyms:2-acetoxyethyl(trimethyl)ammonium;bromide CHEMBL667 [2-(acetyloxy)ethyl]trimethylazanium acetylcholine chloride | cid_6060
TypeSmall Organic Molecule
Emp. Form.C7H16NO2
Mol. Mass.146.2069
SMILESCC(=O)OCC[N+](C)(C)C