Reaction Details
TargetNeuronal acetylcholine receptor subunit alpha-4
LigandBDBM50275304
Substrate/Competitorn/a
Meas. Tech.ChEMBL_494696 (CHEMBL938655)
Ki 15±n/a nM
Citation Hansen, CPJensen, AAChristensen, JKBalle, TLiljefors, TFrølund, B Novel acetylcholine and carbamoylcholine analogues: development of a functionally selective alpha4beta2 nicotinic acetylcholine receptor agonist. J Med Chem51:7380-95 (2009) 
 
Neuronal acetylcholine receptor subunit alpha-4
Name:Neuronal acetylcholine receptor subunit alpha-4
Type:Enzyme
Mol. Mass.:70196.44
Organism:Rattus norvegicus (Rat)
Description:P09483
Residue:630
BDBM50275304
NameBDBM50275304
Synonyms:3-((2-Methylazetidine-1-carbonyloxy)-1-methylpropyl)dimethylammonium Oxalate | CHEMBL455778
TypeSmall organic molecule
Emp. Form.C11H22N2O2
Mol. Mass.214.3046
SMILESCC(CCOC(=O)N1CCC1C)N(C)C