Reaction Details
TargetDelta-type opioid receptor
LigandBDBM50292920
Substrate/Competitorn/a
Meas. Tech.ChEMBL_495339 (CHEMBL1006331)
Ki 278±n/a nM
Citation Li, GAschenbach, LCChen, JCassidy, MPStevens, DLGabra, BHSelley, DEDewey, WLWestkaemper, RBZhang, Y Design, synthesis, and biological evaluation of 6alpha- and 6beta-N-heterocyclic substituted naltrexamine derivatives as mu opioid receptor selective antagonists. J Med Chem52:1416-27 (2010) 
 
Delta-type opioid receptor
Name:Delta-type opioid receptor
Type:G Protein-Coupled Receptor (GPCR)
Mol. Mass.:40382.98
Organism:Homo sapiens (Human)
Description:Competition binding assays were carried out using membrane preparations from transfected HN9.10 cells that constitutively expressed the delta opioid receptor.
Residue:372
BDBM50292920
NameBDBM50292920
Synonyms:17-Cyclopropylmethyl-3,14beta-dihydroxy-4,5r-epoxy-6beta-[(4'-pyridyl)acetamido]morphinan | CHEMBL522143
TypeSmall organic molecule
Emp. Form.C26H29N3O4
Mol. Mass.447.5262
SMILESOc1ccc2C[C@H]3N(CC4CC4)CC[C@@]45[C@@H](Oc1c24)[C@@H](CC[C@@]35O)NC(=O)c1ccncc1