Reaction Details
TargetMu-type opioid receptor
LigandBDBM50292913
Substrate/Competitorn/a
Meas. Tech.ChEMBL_495343 (CHEMBL1007140)
Ki 8.4±n/a nM
Citation Li, GAschenbach, LCChen, JCassidy, MPStevens, DLGabra, BHSelley, DEDewey, WLWestkaemper, RBZhang, Y Design, synthesis, and biological evaluation of 6alpha- and 6beta-N-heterocyclic substituted naltrexamine derivatives as mu opioid receptor selective antagonists. J Med Chem52:1416-27 (2010) 
 
Mu-type opioid receptor
Name:Mu-type opioid receptor
Type:G Protein-Coupled Receptor (GPCR)
Mol. Mass.:44789.51
Organism:Homo sapiens (Human)
Description:P35372
Residue:400
BDBM50292913
NameBDBM50292913
Synonyms:17-Cyclopropylmethyl-3,14beta-dihydroxy-4,5r-epoxy-6alpha-[(2'-naphthalyl)acetamido]morphinan | CHEMBL495058
TypeSmall organic molecule
Emp. Form.C31H32N2O4
Mol. Mass.496.5968
SMILESOc1ccc2C[C@H]3N(CC4CC4)CC[C@@]45[C@@H](Oc1c24)[C@H](CC[C@@]35O)NC(=O)c1ccc2ccccc2c1