Reaction Details
TargetPurine nucleoside phosphorylase
LigandBDBM50247158
Substrate/Competitorn/a
Meas. Tech.ChEMBL_519471 (CHEMBL951777)
Ki 0.380±n/a nM
Citation Clinch, KEvans, GBFröhlich, RFFurneaux, RHKelly, PMLegentil, LMurkin, ASLi, LSchramm, VLTyler, PCWoolhouse, AD Third-generation immucillins: syntheses and bioactivities of acyclic immucillin inhibitors of human purine nucleoside phosphorylase. J Med Chem52:1126-43 (2009) 
 
Purine nucleoside phosphorylase
Name:Purine nucleoside phosphorylase
Type:Enzyme
Mol. Mass.:32119.53
Organism:Homo sapiens (Human)
Description:n/a
Residue:289
BDBM50247158
NameBDBM50247158
Synonyms:7-(((3S,4S)-3-hydroxy-4-(hydroxymethyl)pyrrolidin-1-yl)methyl)-3H-pyrrolo[3,2-d]pyrimidin-4(5H)-one | CHEMBL454743
TypeSmall organic molecule
Emp. Form.C12H16N4O3
Mol. Mass.264.2804
SMILESOC[C@@H]1CN(Cc2c[nH]c3c2nc[nH]c3=O)C[C@H]1O