Reaction Details
TargetPurine nucleoside phosphorylase
LigandBDBM50293067
Substrate/Competitorn/a
Meas. Tech.ChEMBL_519471 (CHEMBL951777)
Ki 1.000±n/a nM
Citation Clinch, KEvans, GBFröhlich, RFFurneaux, RHKelly, PMLegentil, LMurkin, ASLi, LSchramm, VLTyler, PCWoolhouse, AD Third-generation immucillins: syntheses and bioactivities of acyclic immucillin inhibitors of human purine nucleoside phosphorylase. J Med Chem52:1126-43 (2009) 
 
Purine nucleoside phosphorylase
Name:Purine nucleoside phosphorylase
Type:Enzyme
Mol. Mass.:32119.53
Organism:Homo sapiens (Human)
Description:n/a
Residue:289
BDBM50293067
NameBDBM50293067
Synonyms:7-({[(2S,3R)-1,3,4-Trihydroxybutan-2-yl]amino}methyl)-3,5-dihydro-4H-pyrrolo[3,2-d]pyrimidin-4-one | CHEMBL522099
TypeSmall organic molecule
Emp. Form.C11H16N4O4
Mol. Mass.268.2691
SMILESOC[C@H](O)[C@H](CO)NCc1c[nH]c2c1nc[nH]c2=O