Reaction Details
TargetPurine nucleoside phosphorylase
LigandBDBM50293080
Substrate/Competitorn/a
Meas. Tech.ChEMBL_519471 (CHEMBL951777)
Ki 120±n/a nM
Citation Clinch, KEvans, GBFröhlich, RFFurneaux, RHKelly, PMLegentil, LMurkin, ASLi, LSchramm, VLTyler, PCWoolhouse, AD Third-generation immucillins: syntheses and bioactivities of acyclic immucillin inhibitors of human purine nucleoside phosphorylase. J Med Chem52:1126-43 (2009) 
 
Purine nucleoside phosphorylase
Name:Purine nucleoside phosphorylase
Type:Enzyme
Mol. Mass.:32119.53
Organism:Homo sapiens (Human)
Description:n/a
Residue:289
BDBM50293080
NameBDBM50293080
Synonyms:7-{[(2-Hydroxyethyl)(3-hydroxypropyl)amino]methyl}-3,5-dihydro-4H-pyrrolo[3,2-d]pyrimidin-4-one | CHEMBL452368
TypeSmall organic molecule
Emp. Form.C12H18N4O3
Mol. Mass.266.2963
SMILESOCCCN(CCO)Cc1c[nH]c2c1nc[nH]c2=O