Reaction Details
TargetOxytocin receptor
LigandBDBM50412927
Substrate/Competitorn/a
Meas. Tech.ChEMBL_515099 (CHEMBL1035607)
Ki 316.23±n/a nM
Citation Bellenie, BRBarton, NPEmmons, AJHeer, JPSalvagno, C Discovery and optimization of highly ligand-efficient oxytocin receptor antagonists using structure-based drug design. Bioorg Med Chem Lett19:990-4 (2009) 
 
Oxytocin receptor
Name:Oxytocin receptor
Type:Enzyme Catalytic Domain
Mol. Mass.:42793.26
Organism:Homo sapiens (Human)
Description:Oxytocin OXTR HEK293::B2R9L7
Residue:389
BDBM50412927
NameBDBM50412927
Synonyms:CHEMBL515447
TypeSmall organic molecule
Emp. Form.C22H23F3N2O2
Mol. Mass.404.4254
SMILESFC(F)(F)c1ccccc1-c1ccc(cn1)C(=O)N(CC1CC1)CC1CCCO1