Reaction Details
TargetOxytocin receptor
LigandBDBM50412934
Substrate/Competitorn/a
Meas. Tech.ChEMBL_515099 (CHEMBL1035607)
Ki 79.43±n/a nM
Citation Bellenie, BRBarton, NPEmmons, AJHeer, JPSalvagno, C Discovery and optimization of highly ligand-efficient oxytocin receptor antagonists using structure-based drug design. Bioorg Med Chem Lett19:990-4 (2009) 
 
Oxytocin receptor
Name:Oxytocin receptor
Type:Enzyme Catalytic Domain
Mol. Mass.:42793.26
Organism:Homo sapiens (Human)
Description:Oxytocin OXTR HEK293::B2R9L7
Residue:389
BDBM50412934
NameBDBM50412934
Synonyms:CHEMBL480546
TypeSmall organic molecule
Emp. Form.C25H23F3N2O2
Mol. Mass.440.4575
SMILESFC(F)(F)c1ccccc1-c1ccc(cn1)C(=O)N(CC1CCCO1)Cc1ccccc1