Reaction Details
TargetHistone acetyltransferase p300
LigandBDBM50255527
Substrate/Competitorn/a
Meas. Tech.ChEMBL_515393 (CHEMBL1025548)
IC50 6620±n/a nM
Citation Wu, JXie, NWu, ZZhang, YZheng, YG Bisubstrate Inhibitors of the MYST HATs Esa1 and Tip60. Bioorg Med Chem17:1381-6 (2009) 
 
Histone acetyltransferase p300
Name:Histone acetyltransferase p300
Type:Protein
Mol. Mass.:264223.04
Organism:Homo sapiens (Human)
Description:Q09472
Residue:2414
BDBM50255527
NameBDBM50255527
Synonyms:Ac-SGRGKGGKGLGKGGAK(CoA)RHRK | CHEMBL504265
TypeSmall organic molecule
Emp. Form.C107H188N43O40P3S
Mol. Mass.2841.888
SMILESCC(C)C[C@H](NC(=O)CNC(=O)[C@H](CCCCN)NC(=O)CNC(=O)CNC(=O)[C@H](CCCCN)NC(=O)CNC(=O)[C@H](CCCN=C(N)N)NC(=O)CNC(=O)[C@H](CO)NC(C)=O)C(=O)NCC(=O)N[C@@H](CCCCN)C(=O)NCC(=O)NCC(=O)N[C@@H](C)C(=O)N[C@@H](CCCCNC(=O)CSCCNC(=O)CCNC(=O)[C@H](O)C(C)(C)COP(O)(=O)OP(O)(=O)OC[C@H]1O[C@H]([C@H](O)[C@@H]1OP(O)(O)=O)n1cnc2c(N)ncnc12)C(=O)N[C@@H](CCCN=C(N)N)C(=O)N[C@@H](Cc1cnc[nH]1)C(=O)N[C@@H](CCCN=C(N)N)C(=O)N[C@@H](CCCCN)C(O)=O