Reaction Details
TargetHistone acetyltransferase KAT5
LigandBDBM50255529
Substrate/Competitorn/a
Meas. Tech.ChEMBL_515391 (CHEMBL1025546)
IC50 29750±n/a nM
Citation Wu, JXie, NWu, ZZhang, YZheng, YG Bisubstrate Inhibitors of the MYST HATs Esa1 and Tip60. Bioorg Med Chem17:1381-6 (2009) 
 
Histone acetyltransferase KAT5
Name:Histone acetyltransferase KAT5
Type:PROTEIN
Mol. Mass.:58595.98
Organism:Homo sapiens (Human)
Description:ChEMBL_796787
Residue:513
BDBM50255529
NameBDBM50255529
Synonyms:Ac-Lys(CoA)-NH2 | CHEMBL505121
TypeSmall organic molecule
Emp. Form.C31H53N10O19P3S
Mol. Mass.994.794
SMILESCC(=O)N[C@@H](CCCCNC(=O)CSCCNC(=O)CCNC(=O)[C@H](O)C(C)(C)COP(O)(=O)OP(O)(=O)OC[C@H]1O[C@H]([C@H](O)[C@@H]1OP(O)(O)=O)n1cnc2c(N)ncnc12)C(N)=O