Reaction Details
TargetCarbonic anhydrase
LigandBDBM10871
Substrate/Competitorn/a
Meas. Tech.ChEMBL_515851 (CHEMBL993110)
Ki 166±n/a nM
Citation Isik, SKockar, FAydin, MArslan, OGuler, OOInnocenti, AScozzafava, ASupuran, CT Carbonic anhydrase inhibitors: inhibition of the beta-class enzyme from the yeast Saccharomyces cerevisiae with sulfonamides and sulfamates. Bioorg Med Chem17:1158-63 (2009) 
 
Carbonic anhydrase
Name:Carbonic anhydrase
Type:PROTEIN
Mol. Mass.:24861.97
Organism:Saccharomyces cerevisiae
Description:ChEMBL_1507033
Residue:221
BDBM10871
NameBDBM10871
Synonyms:4-amino-N-[(4-sulfamoylphenyl)methyl]benzene-1-sulfonamide aromatic/heteroaromatic sulfonamide 16
TypeSmall organic molecule
Emp. Form.C13H15N3O4S2
Mol. Mass.341.406
SMILESNc1ccc(cc1)S(=O)(=O)NCc1ccc(cc1)S(N)(=O)=O