Reaction Details
TargetDelta-type opioid receptor
LigandBDBM50255134
Substrate/Competitorn/a
Meas. Tech.ChEMBL_515865 (CHEMBL993919)
Ki 9.5±n/a nM
Citation Hayashi, SHirao, AImai, ANakamura, HMurata, YOhashi, KNakata, E Novel non-peptide nociceptin/orphanin FQ receptor agonist, 1-[1-(1-Methylcyclooctyl)-4-piperidinyl]-2-[(3R)-3-piperidinyl]-1H-benzimidazole: design, synthesis, and structure-activity relationship of oral receptor occupancy in the brain for orally potent antianxiety drug. J Med Chem52:610-25 (2009) 
 
Delta-type opioid receptor
Name:Delta-type opioid receptor
Type:G Protein-Coupled Receptor (GPCR)
Mol. Mass.:40382.98
Organism:Homo sapiens (Human)
Description:Competition binding assays were carried out using membrane preparations from transfected HN9.10 cells that constitutively expressed the delta opioid receptor.
Residue:372
BDBM50255134
NameBDBM50255134
Synonyms:2-(3-{1-[1-(1-Methylcyclooctyl)piperidin-4-yl]-1H-benzimidazol-2-yl}phenoxy)ethanol | CHEMBL480425
TypeSmall organic molecule
Emp. Form.C29H39N3O2
Mol. Mass.461.6389
SMILESCC1(CCCCCCC1)N1CCC(CC1)n1c(nc2ccccc12)-c1cccc(OCCO)c1