Reaction Details
TargetMu-type opioid receptor
LigandBDBM50255955
Substrate/Competitorn/a
Meas. Tech.ChEMBL_515867 (CHEMBL993921)
EC50 3673±n/a nM
Citation Hayashi, SHirao, AImai, ANakamura, HMurata, YOhashi, KNakata, E Novel non-peptide nociceptin/orphanin FQ receptor agonist, 1-[1-(1-Methylcyclooctyl)-4-piperidinyl]-2-[(3R)-3-piperidinyl]-1H-benzimidazole: design, synthesis, and structure-activity relationship of oral receptor occupancy in the brain for orally potent antianxiety drug. J Med Chem52:610-25 (2009) 
 
Mu-type opioid receptor
Name:Mu-type opioid receptor
Type:G Protein-Coupled Receptor (GPCR)
Mol. Mass.:44789.51
Organism:Homo sapiens (Human)
Description:P35372
Residue:400
BDBM50255955
NameBDBM50255955
Synonyms:2-(1-Benzofuran-2-yl)-1-[1-(1-methylcyclooctyl)piperidin-4-yl]-1H-benzimidazole | CHEMBL481707
TypeSmall organic molecule
Emp. Form.C29H35N3O
Mol. Mass.441.6077
SMILESCC1(CCCCCCC1)N1CCC(CC1)n1c(nc2ccccc12)-c1cc2ccccc2o1