Reaction Details
TargetKappa-type opioid receptor
LigandBDBM50255898
Substrate/Competitorn/a
Meas. Tech.ChEMBL_515868 (CHEMBL993922)
EC50 70±n/a nM
Citation Hayashi, SHirao, AImai, ANakamura, HMurata, YOhashi, KNakata, E Novel non-peptide nociceptin/orphanin FQ receptor agonist, 1-[1-(1-Methylcyclooctyl)-4-piperidinyl]-2-[(3R)-3-piperidinyl]-1H-benzimidazole: design, synthesis, and structure-activity relationship of oral receptor occupancy in the brain for orally potent antianxiety drug. J Med Chem52:610-25 (2009) 
 
Kappa-type opioid receptor
Name:Kappa-type opioid receptor
Type:G Protein-Coupled Receptor (GPCR)
Mol. Mass.:42648.76
Organism:Homo sapiens (Human)
Description:P41145
Residue:380
BDBM50255898
NameBDBM50255898
Synonyms:1-[1-(1-Methylcyclooctyl)-4-piperidinyl]-2-[(3R)-1-methyl-3-piperidinyl]-1H-benzimidazole | CHEMBL518950
TypeSmall organic molecule
Emp. Form.C27H42N4
Mol. Mass.422.6492
SMILESCN1CCC[C@H](C1)c1nc2ccccc2n1C1CCN(CC1)C1(C)CCCCCCC1