Reaction Details
TargetNociceptin receptor
LigandBDBM50255134
Substrate/Competitorn/a
Meas. Tech.ChEMBL_515862 (CHEMBL993121)
Ki 0.300000±n/a nM
Citation Hayashi, SHirao, AImai, ANakamura, HMurata, YOhashi, KNakata, E Novel non-peptide nociceptin/orphanin FQ receptor agonist, 1-[1-(1-Methylcyclooctyl)-4-piperidinyl]-2-[(3R)-3-piperidinyl]-1H-benzimidazole: design, synthesis, and structure-activity relationship of oral receptor occupancy in the brain for orally potent antianxiety drug. J Med Chem52:610-25 (2009) 
 
Nociceptin receptor
Name:Nociceptin receptor
Type:G Protein-Coupled Receptor (GPCR)
Mol. Mass.:40702.87
Organism:Homo sapiens (Human)
Description:P41146
Residue:370
BDBM50255134
NameBDBM50255134
Synonyms:2-(3-{1-[1-(1-Methylcyclooctyl)piperidin-4-yl]-1H-benzimidazol-2-yl}phenoxy)ethanol | CHEMBL480425
TypeSmall organic molecule
Emp. Form.C29H39N3O2
Mol. Mass.461.6389
SMILESCC1(CCCCCCC1)N1CCC(CC1)n1c(nc2ccccc12)-c1cccc(OCCO)c1