Reaction Details
TargetMu-type opioid receptor
LigandBDBM50255953
Substrate/Competitorn/a
Meas. Tech.ChEMBL_515867 (CHEMBL993921)
Ki 45±n/a nM
Citation Hayashi, SHirao, AImai, ANakamura, HMurata, YOhashi, KNakata, E Novel non-peptide nociceptin/orphanin FQ receptor agonist, 1-[1-(1-Methylcyclooctyl)-4-piperidinyl]-2-[(3R)-3-piperidinyl]-1H-benzimidazole: design, synthesis, and structure-activity relationship of oral receptor occupancy in the brain for orally potent antianxiety drug. J Med Chem52:610-25 (2009) 
 
Mu-type opioid receptor
Name:Mu-type opioid receptor
Type:G Protein-Coupled Receptor (GPCR)
Mol. Mass.:44789.51
Organism:Homo sapiens (Human)
Description:P35372
Residue:400
BDBM50255953
NameBDBM50255953
Synonyms:2-(3-Chloro-4-fluorophenyl)-1-[1-(1-methylcyclooctyl)piperidin-4-yl]-1H-benzimidazole | CHEMBL481547
TypeSmall organic molecule
Emp. Form.C27H33ClFN3
Mol. Mass.454.022
SMILESCC1(CCCCCCC1)N1CCC(CC1)n1c(nc2ccccc12)-c1ccc(F)c(Cl)c1