Reaction Details
TargetMatrix metalloproteinase-9
LigandBDBM50255212
Substrate/Competitorn/a
Meas. Tech.ChEMBL_516050 (CHEMBL982420)
IC50 8000±n/a nM
Citation Claramunt, RMBouissane, LCabildo, MPCornago, MPElguero, JRadziwon, AMedina, C Synthesis and biological evaluation of curcuminoid pyrazoles as new therapeutic agents in inflammatory bowel disease: effect on matrix metalloproteinases. Bioorg Med Chem17:1290-6 (2009) 
 
Matrix metalloproteinase-9
Name:Matrix metalloproteinase-9
Type:Enzyme
Mol. Mass.:78452.28
Organism:Homo sapiens (Human)
Description:P14780
Residue:707
BDBM50255212
NameBDBM50255212
Synonyms:(E)-3(5)-[beta-(4-hydroxy-3-methoxyphenyl)-ethenyl]-4,5(3)-dimethyl-1H-pyrazole | CHEMBL481600
TypeSmall organic molecule
Emp. Form.C14H16N2O2
Mol. Mass.244.289
SMILESCOc1cc(C=Cc2[nH]nc(C)c2C)ccc1O