Reaction Details
TargetMatrix metalloproteinase-9
LigandBDBM50255211
Substrate/Competitorn/a
Meas. Tech.ChEMBL_516050 (CHEMBL982420)
IC50 17600±n/a nM
Citation Claramunt, RMBouissane, LCabildo, MPCornago, MPElguero, JRadziwon, AMedina, C Synthesis and biological evaluation of curcuminoid pyrazoles as new therapeutic agents in inflammatory bowel disease: effect on matrix metalloproteinases. Bioorg Med Chem17:1290-6 (2009) 
 
Matrix metalloproteinase-9
Name:Matrix metalloproteinase-9
Type:Enzyme
Mol. Mass.:78452.28
Organism:Homo sapiens (Human)
Description:P14780
Residue:707
BDBM50255211
NameBDBM50255211
Synonyms:(E)-3(5)-[beta-(4-hydroxy-3-methoxyphenyl)-ethenyl]-5(3)-methyl-1H-pyrazole | CHEMBL481599
TypeSmall organic molecule
Emp. Form.C13H14N2O2
Mol. Mass.230.2625
SMILESCOc1cc(C=Cc2cc(C)n[nH]2)ccc1O