Reaction Details
TargetRyanodine receptor 1
LigandBDBM50191278
Substrate/Competitorn/a
Meas. Tech.ChEMBL_497239 (CHEMBL1006192)
EC50 11000±n/a nM
Citation Zieminska, ELazarewicz, JWCouladouros, EAMoutsos, VIPitsinos, EN Open-chain half-bastadins mimic the effects of cyclic bastadins on calcium homeostasis in cultured neurons. Bioorg Med Chem Lett18:5734-7 (2009) 
 
Ryanodine receptor 1
Name:Ryanodine receptor 1
Type:PROTEIN
Mol. Mass.:565027.60
Organism:Homo sapiens (Human)
Description:ChEMBL_196055
Residue:5038
BDBM50191278
NameBDBM50191278
Synonyms:(+/-)-5,17-dibromo-4-hydroxy-2-oxa-10-aza-tricyclo[12.2.2.10,0]-nonadeca-1(17),3(19),4,6,14(18),15-hexaen-11-one CHEMBL386905
TypeSmall organic molecule
Emp. Form.C17H15Br2NO3
Mol. Mass.441.114
SMILESOc1c(Br)cc2CCNC(=O)CCc3ccc(Oc1c2)c(Br)c3