Reaction Details
TargetRyanodine receptor 1
LigandBDBM50191286
Substrate/Competitorn/a
Meas. Tech.ChEMBL_497239 (CHEMBL1006192)
EC50 2200±n/a nM
Citation Zieminska, ELazarewicz, JWCouladouros, EAMoutsos, VIPitsinos, EN Open-chain half-bastadins mimic the effects of cyclic bastadins on calcium homeostasis in cultured neurons. Bioorg Med Chem Lett18:5734-7 (2009) 
 
Ryanodine receptor 1
Name:Ryanodine receptor 1
Type:PROTEIN
Mol. Mass.:565027.60
Organism:Homo sapiens (Human)
Description:ChEMBL_196055
Residue:5038
BDBM50191286
NameBDBM50191286
Synonyms:Bastadin-5 bastadin 5
TypeSmall organic molecule
Emp. Form.C34H27Br5N4O8
Mol. Mass.1019.12
SMILESOc1c(Br)cc2CCNC(=O)C(Cc3cc(Br)c(Oc4cc(CC(N=O)C(=O)NCCc5ccc(Oc1c2)c(Br)c5)cc(Br)c4O)c(Br)c3)N=O