Reaction Details
TargetSodium-dependent serotonin transporter
LigandBDBM50276591
Substrate/Competitorn/a
Meas. Tech.ChEMBL_541287 (CHEMBL1031546)
Ki 3.2±n/a nM
Citation Voelker, TXia, HFandrick, KJohnson, RJanowsky, ACashman, JR 2,5-Disubstituted tetrahydrofurans as selective serotonin re-uptake inhibitors. Bioorg Med Chem17:2047-68 (2009) 
 
Sodium-dependent serotonin transporter
Name:Sodium-dependent serotonin transporter
Type:Multi-pass membrane protein
Mol. Mass.:70322.51
Organism:Homo sapiens (Human)
Description:P31645
Residue:630
BDBM50276591
NameBDBM50276591
Synonyms:CHEMBL511500 | trans-2-(Aminomethyl)-5-(2'-methoxy-5'-fluorophenethyl)tetrahydrofuran
TypeSmall organic molecule
Emp. Form.C14H20FNO2
Mol. Mass.253.3125
SMILESCOc1ccc(F)cc1CC[C@H]1CC[C@H](CN)O1