Reaction Details
TargetSodium-dependent serotonin transporter
LigandBDBM50276642
Substrate/Competitorn/a
Meas. Tech.ChEMBL_541287 (CHEMBL1031546)
Ki 0.8±n/a nM
Citation Voelker, TXia, HFandrick, KJohnson, RJanowsky, ACashman, JR 2,5-Disubstituted tetrahydrofurans as selective serotonin re-uptake inhibitors. Bioorg Med Chem17:2047-68 (2009) 
 
Sodium-dependent serotonin transporter
Name:Sodium-dependent serotonin transporter
Type:Multi-pass membrane protein
Mol. Mass.:70322.51
Organism:Homo sapiens (Human)
Description:P31645
Residue:630
BDBM50276642
NameBDBM50276642
Synonyms:CHEMBL460407 | trans-2-Aminomethyl-5-((2''-methoxy-5''-fluorophenyl)-3'-propyl)tetrahydrofuran
TypeSmall organic molecule
Emp. Form.C15H22FNO2
Mol. Mass.267.3391
SMILESCOc1ccc(F)cc1CCC[C@H]1CC[C@H](CN)O1