Reaction Details
TargetSodium-dependent serotonin transporter
LigandBDBM30132
Substrate/Competitorn/a
Meas. Tech.ChEMBL_541287 (CHEMBL1031546)
Ki 1.1±n/a nM
Citation Voelker, TXia, HFandrick, KJohnson, RJanowsky, ACashman, JR 2,5-Disubstituted tetrahydrofurans as selective serotonin re-uptake inhibitors. Bioorg Med Chem17:2047-68 (2009) 
 
Sodium-dependent serotonin transporter
Name:Sodium-dependent serotonin transporter
Type:Multi-pass membrane protein
Mol. Mass.:70322.51
Organism:Homo sapiens (Human)
Description:P31645
Residue:630
BDBM30132
NameBDBM30132
Synonyms:CHEMBL450907 | tetrahydrofuranyl ethylamine, 15
TypeSmall organic molecule
Emp. Form.C16H24FNO2
Mol. Mass.281.3657
SMILESCOc1ccc(F)cc1CCCC1CCC(CCN)O1