Reaction Details
TargetHeat shock protein HSP 90-alpha
LigandBDBM50276167
Substrate/Competitorn/a
Meas. Tech.ChEMBL_542628 (CHEMBL1015017)
Kd 0.8±n/a nM
Citation Menzella, HGTran, TTCarney, JRLau-Wee, JGalazzo, JReeves, CDCarreras, CMukadam, SEng, SZhong, ZTimmermans, PBMurli, SAshley, GW Potent non-benzoquinone ansamycin heat shock protein 90 inhibitors from genetic engineering of Streptomyces hygroscopicus. J Med Chem52:1518-21 (2009) 
 
Heat shock protein HSP 90-alpha
Name:Heat shock protein HSP 90-alpha
Type:Molecular Chaperone
Mol. Mass.:84623.45
Organism:Homo sapiens (Human)
Description:P07900
Residue:732
BDBM50276167
NameBDBM50276167
Synonyms:CHEMBL512489 | Carbamic acid (4E,10E)-(8S,9S,12S,13R,14S,16R)-13,19-dihydroxy-8,14-dimethoxy-4,10,12,16-tetramethyl-3-oxo-2-aza-bicyclo[16.3.1]docosa-1(22),4,10,18,20-pentaen-9-yl ester
TypeSmall organic molecule
Emp. Form.C28H42N2O7
Mol. Mass.518.6423
SMILESCO[C@H]1CC\C=C(C)\C(=O)Nc2ccc(O)c(C[C@@H](C)C[C@H](OC)[C@H](O)[C@@H](C)\C=C(C)\[C@@H]1OC(N)=O)c2