Reaction Details
TargetAmine oxidase [flavin-containing] A
LigandBDBM50276717
Substrate/Competitorn/a
Meas. Tech.ChEMBL_543072 (CHEMBL1022171)
Ki 3780±n/a nM
Citation Vilches-Herrera, MMiranda-Sepúlveda, JRebolledo-Fuentes, MFierro, ALühr, SIturriaga-Vasquez, PCassels, BKReyes-Parada, M Naphthylisopropylamine and N-benzylamphetamine derivatives as monoamine oxidase inhibitors. Bioorg Med Chem17:2452-60 (2009) 
 
Amine oxidase [flavin-containing] A
Name:Amine oxidase [flavin-containing] A
Type:Enzyme
Mol. Mass.:59515.21
Organism:Rattus norvegicus (rat)
Description:n/a
Residue:526
BDBM50276717
NameBDBM50276717
Synonyms:(6-Benzyloxy-2-naphthyl)-2-aminopropane | CHEMBL456006
TypeSmall organic molecule
Emp. Form.C20H21NO
Mol. Mass.291.3868
SMILESCC(N)Cc1ccc2cc(OCc3ccccc3)ccc2c1