Reaction Details
TargetAmine oxidase [flavin-containing] A
LigandBDBM50276718
Substrate/Competitorn/a
Meas. Tech.ChEMBL_543072 (CHEMBL1022171)
Ki 500±n/a nM
Citation Vilches-Herrera, MMiranda-Sepúlveda, JRebolledo-Fuentes, MFierro, ALühr, SIturriaga-Vasquez, PCassels, BKReyes-Parada, M Naphthylisopropylamine and N-benzylamphetamine derivatives as monoamine oxidase inhibitors. Bioorg Med Chem17:2452-60 (2009) 
 
Amine oxidase [flavin-containing] A
Name:Amine oxidase [flavin-containing] A
Type:Enzyme
Mol. Mass.:59515.21
Organism:Rattus norvegicus (rat)
Description:n/a
Residue:526
BDBM50276718
NameBDBM50276718
Synonyms:(6-methylthio-2-naphthyl)isopropylamine | CHEMBL455558
TypeSmall organic molecule
Emp. Form.C14H17NS
Mol. Mass.231.356
SMILESCSc1ccc2cc(CC(C)N)ccc2c1