Reaction Details
TargetAmine oxidase [flavin-containing] A
LigandBDBM50063544
Substrate/Competitorn/a
Meas. Tech.ChEMBL_543072 (CHEMBL1022171)
Ki 250±n/a nM
Citation Vilches-Herrera, MMiranda-Sepúlveda, JRebolledo-Fuentes, MFierro, ALühr, SIturriaga-Vasquez, PCassels, BKReyes-Parada, M Naphthylisopropylamine and N-benzylamphetamine derivatives as monoamine oxidase inhibitors. Bioorg Med Chem17:2452-60 (2009) 
 
Amine oxidase [flavin-containing] A
Name:Amine oxidase [flavin-containing] A
Type:Enzyme
Mol. Mass.:59515.21
Organism:Rattus norvegicus (rat)
Description:n/a
Residue:526
BDBM50063544
NameBDBM50063544
Synonyms:1-(6-(methylthio)naphthalen-2-yl)propan-2-amine 2-Amino-1-(4-methylthiophenyl)propane | CHEMBL6467
TypeSmall organic molecule
Emp. Form.C10H15NS
Mol. Mass.181.298
SMILESCSc1ccc(CC(C)N)cc1