Reaction Details
TargetDelta-type opioid receptor
LigandBDBM50248991
Substrate/Competitorn/a
Meas. Tech.ChEMBL_543323 (CHEMBL1022993)
Ki 180±n/a nM
Citation Moynihan, HJales, ARGreedy, BMRennison, DBroadbear, JHPurington, LTraynor, JRWoods, JHLewis, JWHusbands, SM 14 beta-O-cinnamoylnaltrexone and related dihydrocodeinones are mu opioid receptor partial agonists with predominant antagonist activity. J Med Chem52:1553-7 (2009) 
 
Delta-type opioid receptor
Name:Delta-type opioid receptor
Type:G Protein-Coupled Receptor (GPCR)
Mol. Mass.:40382.98
Organism:Homo sapiens (Human)
Description:Competition binding assays were carried out using membrane preparations from transfected HN9.10 cells that constitutively expressed the delta opioid receptor.
Residue:372
BDBM50248991
NameBDBM50248991
Synonyms:CHEMBL474755 | N-Cyclopropylmethyl-14beta-cinnamoyloxy-7,8-dihydrocodeinone
TypeSmall organic molecule
Emp. Form.C30H31NO5
Mol. Mass.485.5708
SMILESCOc1ccc2C[C@H]3N(CC4CC4)CC[C@@]45[C@@H](Oc1c24)C(=O)CC[C@@]35OC(=O)\C=C\c1ccccc1