Reaction Details
TargetKappa-type opioid receptor
LigandBDBM50248968
Substrate/Competitorn/a
Meas. Tech.ChEMBL_543321 (CHEMBL1022991)
Ki 3.6±n/a nM
Citation Moynihan, HJales, ARGreedy, BMRennison, DBroadbear, JHPurington, LTraynor, JRWoods, JHLewis, JWHusbands, SM 14 beta-O-cinnamoylnaltrexone and related dihydrocodeinones are mu opioid receptor partial agonists with predominant antagonist activity. J Med Chem52:1553-7 (2009) 
 
Kappa-type opioid receptor
Name:Kappa-type opioid receptor
Type:G Protein-Coupled Receptor (GPCR)
Mol. Mass.:42744.99
Organism:Cavia porcellus (domestic guinea pig)
Description:P41144
Residue:380
BDBM50248968
NameBDBM50248968
Synonyms:14beta-Cinnamoyloxy-N-cyclopropylmethyl-7,8-dihydronormorphinone | CHEMBL473206
TypeSmall organic molecule
Emp. Form.C29H29NO5
Mol. Mass.471.5443
SMILESOc1ccc2C[C@H]3N(CC4CC4)CC[C@@]45[C@@H](Oc1c24)C(=O)CC[C@@]35OC(=O)\C=C\c1ccccc1