Reaction Details
TargetKappa-type opioid receptor
LigandBDBM50248990
Substrate/Competitorn/a
Meas. Tech.ChEMBL_543321 (CHEMBL1022991)
Ki 8.1±n/a nM
Citation Moynihan, HJales, ARGreedy, BMRennison, DBroadbear, JHPurington, LTraynor, JRWoods, JHLewis, JWHusbands, SM 14 beta-O-cinnamoylnaltrexone and related dihydrocodeinones are mu opioid receptor partial agonists with predominant antagonist activity. J Med Chem52:1553-7 (2009) 
 
Kappa-type opioid receptor
Name:Kappa-type opioid receptor
Type:G Protein-Coupled Receptor (GPCR)
Mol. Mass.:42744.99
Organism:Cavia porcellus (domestic guinea pig)
Description:P41144
Residue:380
BDBM50248990
NameBDBM50248990
Synonyms:14beta-(4-Methylcinnamoyloxy)-N-cyclopropylmethyl-7,8-dihydronormorphinone | CHEMBL474641
TypeSmall organic molecule
Emp. Form.C30H31NO5
Mol. Mass.485.5708
SMILESCc1ccc(\C=C\C(=O)O[C@]23CCC(=O)[C@@H]4Oc5c6c(C[C@H]2N(CC2CC2)CC[C@@]346)ccc5O)cc1