Reaction Details
TargetC-C chemokine receptor type 5
LigandBDBM50248322
Substrate/Competitorn/a
Meas. Tech.ChEMBL_543512 (CHEMBL1019461)
IC50 0.137±n/a nM
Citation Barber, CGBlakemore, DCChiva, JYEastwood, RLMiddleton, DSParadowski, KA 1-Amido-1-phenyl-3-piperidinylbutanes--CCR5 antagonists for the treatment of HIV: part 2. Bioorg Med Chem Lett19:1499-503 (2009) 
 
C-C chemokine receptor type 5
Name:C-C chemokine receptor type 5
Type:Enzyme
Mol. Mass.:40540.21
Organism:Homo sapiens (Human)
Description:P51681
Residue:352
BDBM50248322
NameBDBM50248322
Synonyms:(+/-)-N-((1S)-3-(4-(3-isopropyl-5-methyl-4H-1,2,4-triazol-4-yl)piperidin-1-yl)-1-phenylbutyl)cyclopentanecarboxamide | CHEMBL473558
TypeSmall organic molecule
Emp. Form.C27H41N5O
Mol. Mass.451.6473
SMILESCC(C)c1nnc(C)n1C1CCN(CC1)C(C)C[C@H](NC(=O)C1CCCC1)c1ccccc1