Reaction Details
TargetCarbonic anhydrase 9
LigandBDBM10881
Substrate/Competitorn/a
Meas. Tech.ChEMBL_565862 (CHEMBL959285)
Ki 27±n/a nM
Citation Crocetti, LMaresca, ATemperini, CHall, RAScozzafava, AMühlschlegel, FASupuran, CT A thiabendazole sulfonamide shows potent inhibitory activity against mammalian and nematode alpha-carbonic anhydrases. Bioorg Med Chem Lett19:1371-5 (2009) 
 
Carbonic anhydrase 9
Name:Carbonic anhydrase 9
Type:Enzyme
Mol. Mass.:49669.03
Organism:Homo sapiens (Human)
Description:Catalytic domain of human cloned isozyme was used in the assay
Residue:459
BDBM10881
NameBDBM10881
Synonyms:CHEMBL288100 Methazolamide Methazolamide, MZA Sulfonamide, 2 sulfonamide 2
TypeSmall organic molecule
Emp. Form.C5H8N4O3S2
Mol. Mass.236.272
SMILESCC(=O)N=c1sc(nn1C)S(N)(=O)=O