Reaction Details
TargetCarbonic anhydrase 12
LigandBDBM50248167
Substrate/Competitorn/a
Meas. Tech.ChEMBL_565863 (CHEMBL959286)
Ki 17.8±n/a nM
Citation Crocetti, LMaresca, ATemperini, CHall, RAScozzafava, AMühlschlegel, FASupuran, CT A thiabendazole sulfonamide shows potent inhibitory activity against mammalian and nematode alpha-carbonic anhydrases. Bioorg Med Chem Lett19:1371-5 (2009) 
 
Carbonic anhydrase 12
Name:Carbonic anhydrase 12
Type:Enzyme
Mol. Mass.:39456.00
Organism:Homo sapiens (Human)
Description:Catalytic domain of human cloned isozyme was used in the assay
Residue:354
BDBM50248167
NameBDBM50248167
Synonyms:2-(1,3-thiazol-4-yl)-1H-benzimidazole-5-sulfonamide CHEMBL455271
TypeSmall organic molecule
Emp. Form.C10H8N4O2S2
Mol. Mass.280.326
SMILESNS(=O)(=O)c1ccc2nc([nH]c2c1)-c1cscn1