Reaction Details
TargetCarbonic anhydrase 13
LigandBDBM25904
Substrate/Competitorn/a
Meas. Tech.ChEMBL_565864 (CHEMBL959287)
Ki 2633±n/a nM
Citation Crocetti, LMaresca, ATemperini, CHall, RAScozzafava, AMühlschlegel, FASupuran, CT A thiabendazole sulfonamide shows potent inhibitory activity against mammalian and nematode alpha-carbonic anhydrases. Bioorg Med Chem Lett19:1371-5 (2009) 
 
Carbonic anhydrase 13
Name:Carbonic anhydrase 13
Type:Enzyme
Mol. Mass.:29522.80
Organism:Mus musculus (mouse)
Description:Murine cloned isozyme
Residue:262
BDBM25904
NameBDBM25904
Synonyms:2-(hydrazinecarbonyl)-3-phenyl-1H-indole-5-sulfonamide CHEMBL262628 | indole sulfonamide, L
TypeSmall organic molecule
Emp. Form.C15H14N4O3S
Mol. Mass.330.362
SMILESNNC(=O)c1[nH]c2ccc(cc2c1-c1ccccc1)S(N)(=O)=O