Reaction Details
TargetSodium/glucose cotransporter 2
LigandBDBM20878
Substrate/Competitorn/a
Meas. Tech.ChEMBL_566717 (CHEMBL961709)
Ki 2.4±n/a nM
Citation Washburn, WN Development of the renal glucose reabsorption inhibitors: a new mechanism for the pharmacotherapy of diabetes mellitus type 2. J Med Chem52:1785-94 (2009) 
 
Sodium/glucose cotransporter 2
Name:Sodium/glucose cotransporter 2
Type:Protein
Mol. Mass.:72902.00
Organism:Homo sapiens (Human)
Description:P31639
Residue:672
BDBM20878
NameBDBM20878
Synonyms:(2R,3S,4S,5R,6S)-2-(hydroxymethyl)-6-{2-[(4-methoxyphenyl)methyl]phenoxy}oxane-3,4,5-triol O-glucoside, 4a
TypeSmall organic molecule
Emp. Form.C20H24O7
Mol. Mass.376.4004
SMILESCOc1ccc(Cc2ccccc2O[C@@H]2O[C@H](CO)[C@@H](O)[C@H](O)[C@H]2O)cc1