Reaction Details
TargetCyclin-dependent kinase 1
LigandBDBM50113707
Substrate/Competitorn/a
Meas. Tech.ChEMBL_563791 (CHEMBL993554)
IC50 340±n/a nM
Citation Gray, NSWodicka, LThunnissen, AMNorman, TCKwon, SEspinoza, FHMorgan, DOBarnes, GLeClerc, SMeijer, LKim, SHLockhart, DJSchultz, PG Exploiting chemical libraries, structure, and genomics in the search for kinase inhibitors. Science281:533-538 (1998) Cyclin-dependent kinase 1
Name:Cyclin-dependent kinase 1
Type:Enzyme Subunit
Mol. Mass.:34101.08
Organism:Homo sapiens (Human)
Description:P06493
Residue:297
BDBM50113707
NameBDBM50113707
Synonyms:2,6,9-Trisubstitute purine, 2 2-[6-(3-Chloro-phenylamino)-9-isopropyl-9H-purin-2-ylamino]-ethanol | CHEMBL311228
TypeSmall organic molecule
Emp. Form.C16H19ClN6O
Mol. Mass.346.815
SMILESCC(C)n1cnc2c(Nc3cccc(Cl)c3)nc(NCCO)nc12